<body> <script type="text/javascript" src="https://ad.netowl.jp/js/webcrow-php.js"></script>
私立メロン高校パソコン部
13057423

hitomi&nhentaiダウンローダpython


2018年09月20日 09:56:03

hitomiとnhentaiの画像を落とす画像ダウンローダです。

1.hitomiとnhentaiの漫画単体を全て一括で落とす。
2.hitomiとnhentaiの新着漫画を落とす。
3.nhentaiの特定タグ、特定キャラ、特定アーティスト、
特定カテゴリー、特定言語の漫画を一括で落とす。
4.nhentaiの特定タグ、特定キャラ、特定アーティスト、
特定カテゴリー、特定言語の漫画を一括で落とす。
5.hitomiの特定タグ、特定シリーズ、特定アーティスト、
特定カテゴリー、特定言語の漫画を一括で落とす。
6.nhentaiの検索で検出された漫画を一括で落とす。

pythonなのでマルチプラットフォームソフトです。
MacOSX、Windows、Linuxで動きます。

2019/11/25
ダウンロード
ver1.1.7

posted by 管理人
カテゴリー 同人画像ダウンローダ
view(113118)
コメント(234)


208.名前:名無し 2020年08月26日 08:10:03ID:bf93c3

hitomiがダウンロード出来ません
>>196と同じ現象が発生しまったく機能しないです
nhentaiは出来るんですが…


209.名前:名無し 2020年08月28日 02:43:03ID:ca004c

hitomiでダウンロードしようとしても
どうしてもwebpに拡張子がつかないです
nhentaiの方は問題なく落とせるんですが


210.名前:名無し 2020年09月07日 03:04:03ID:a391a3

nhenで日本語を取得しない
DevTools listening on ws://127.0.0.1:50561/devtools/browser/ec031449-2099-49f3-aecb-fd8daef9f6bd
[708:5428:0907/150313.133:ERROR:device_event_log_impl.cc(208)] [15:03:13.133] Bluetooth: bluetooth_adapter_winrt.cc:1074 Getting Default Adapter failed.


211.名前:名無しの厄介者 2020年09月22日 04:08:03ID:91d807

hitomiでダウンロードしてると同時にAVIF形式のファイルも落としてしまうのですが、改善は出来ないでしょうか?
一応全ページダウンロードは出来るのですが、やはり不便で…


212.名前:名無し 2020年10月19日 04:48:03ID:e2fbc1

=== エラー内容 ===
type:<class 'selenium.common.exceptions.WebDriverException'>
error:Message: unknown error: cannot find Chrome binary
(Driver info: chromedriver=2.41.578737 (49da6702b16031c40d63e5618de03a32ff6c197e),platform=Windows NT 10.0.19041 x86_64)

エラー行番号142
=== エラー内容 ===
type:<class 'AttributeError'>
error:'NoneType' object has no attribute 'title'
エラー行番号159
Traceback (most recent call last):
File "E:softpyexehitomi.py", line 779, in <module>
File "E:softpyexehitomi.py", line 669, in nhentai_batch
File "E:softpyexehitomi.py", line 175, in nhentai_func
UnboundLocalError: local variable 'web_st' referenced before assignment
続行するには何かキーを押してください . . .
Vr1.1.7 6番を選びました


213.名前:名無し 2020年10月20日 04:22:03ID:aab1c5

APIで書かれてるアップグレードやったら>212と同じ現象
こっちは古いのかな
sankakuは正常に動いてる


214.名前:名無し 2020年11月16日 09:41:03ID:f6c944

Ctrl+VでペーストできないからURLをタイプしないといけないのが面倒。

215.名前:名無し 2020年11月23日 05:42:03ID:3b5f7a

2番でDLした際、AVIFとwebpの双方が混ざりあった状態でDLが終了しました。
他のものはjpgで落とせているのですが。


216.名前:名無し 2020年11月23日 01:22:03ID:a61489

nhentaiの漫画単体urlを入力してエンターキーを押してください
ttps://nhentai.net/g/314921/
=== エラー内容 ===
type:<class 'selenium.common.exceptions.WebDriverException'>
error:Message: unknown error: cannot find Chrome binary
(Driver info: chromedriver=2.41.578737 (49da6702b16031c40d63e5618de03a32ff6c197e),platform=Windows NT 10.0.19042 x86_64)

エラー行番号142
=== エラー内容 ===
type:<class 'AttributeError'>
error:'NoneType' object has no attribute 'title'
エラー行番号159
Traceback (most recent call last):
File "E:softpyexehitomi.py", line 768, in <module>
File "E:softpyexehitomi.py", line 175, in nhentai_func
UnboundLocalError: local variable 'web_st' referenced before assignment
続行するには何かキーを押してください . . .


217.名前:名無し 2020年11月23日 01:28:03ID:a61489

エラー行番号467
=== エラー内容 ===
type:<class 'AttributeError'>
error:'NoneType' object has no attribute 'current_url'
エラー行番号478
=== エラー内容 ===
type:<class 'AttributeError'>
error:'NoneType' object has no attribute 'find_elements_by_tag_name'
エラー行番号379
=== エラー内容 ===
type:<class 'AttributeError'>
error:'NoneType' object has no attribute 'find_elements_by_tag_name'
エラー行番号404
=== エラー内容 ===
type:<class 'AttributeError'>
error:'NoneType' object has no attribute 'current_url'
エラー行番号461
=== エラー内容 ===
type:<class 'AttributeError'>
error:'NoneType' object has no attribute 'find_element_by_xpath'
エラー行番号467
=== エラー内容 ===
type:<class 'AttributeError'>
error:'NoneType' object has no attribute 'current_url'
エラー行番号478
=== エラー内容 ===
type:<class 'AttributeError'>
error:'NoneType' object has no attribute 'find_elements_by_tag_name'
エラー行番号379
=== エラー内容 ===
type:<class 'AttributeError'>
error:'NoneType' object has no attribute 'find_elements_by_tag_name'
エラー行番号404
=== エラー内容 ===
type:<class 'AttributeError'>
error:'NoneType' object has no attribute 'current_url'
エラー行番号461
=== エラー内容 ===
type:<class 'AttributeError'>
error:'NoneType' object has no attribute 'find_element_by_xpath'
これが延々続きます


218.名前:名無し 2020年11月27日 04:13:03ID:3b5f7a

ID:3b5f7aです。
settingのhitomi_webp=0で解決しました。
余分な枠を取ってしまい、申し訳ありませんでした。


219.名前:名無し 2020年12月07日 12:58:03ID:78e442

ダウンロード自体は出来るのですか順番がめちゃくちゃになるのってどうすれば良いですかね


220.名前:名無し 2020年12月07日 12:58:03ID:78e442

ダウンロード自体は出来るのですか順番がめちゃくちゃになるのってどうすれば良いですかね


221.名前:名無しさん 2020年12月07日 01:01:03ID:78e442

ダウンロードは出来るのですが順番がめちゃくちゃになるのはどうすればいいでしょうか?

222.名前:名無し 2020年12月26日 10:50:03ID:2f55b1

nhentaiです
>>212の方と同じエラーが出ます
=== エラー内容 ===
type:<class 'selenium.common.exceptions.WebDriverException'>
error:Message: unknown error: cannot find Chrome binary
(Driver info: chromedriver=2.41.578737 (49da6702b16031c40d63e5618de03a32ff6c197e),platform=Windows NT 10.0.19042 x86_64)

エラー行番号142
=== エラー内容 ===
type:<class 'AttributeError'>
error:'NoneType' object has no attribute 'title'
エラー行番号159
Traceback (most recent call last):
File "E:softpyexehitomi.py", line 768, in <module>
File "E:softpyexehitomi.py", line 175, in nhentai_func
UnboundLocalError: local variable 'web_st' referenced before assignment
続行するには何かキーを押してください . . .


223.名前:222 2020年12月26日 11:35:03ID:2f55b1

>>212ではなく>>216でした…

224.名前:222 2020年12月27日 04:50:03ID:2f55b1

自己解決しました。
どうやらchromeを「‪C:Program Files」ではなく
「C:Program Files (x86)」に入れたら起動しました。
なので解決方法を。
1.「‪C:Program Files」にchromeがある場合、アンインストール
2.chrome32bit版をインストールする
(「C:Program Files (x86)」にインストールされる為
 状況が整っていればこの時点で起動できるはず)
3.64bit版を使用したい場合、64bit版をそのままインストールする


225.名前:名無し 2021年01月17日 11:41:03ID:c87128

順序がバラバラになるのを解消するには、ファイルの並び替えを『作成日時』ではなく『更新日時』すればOKです。
それでファイル名を順番に付け直せば順序良く並べ替えができます。


226.名前:名無し 2021年02月06日 09:38:03ID:5114da

「1.hitomiとnhentaiの漫画単体を全て一括で落とす」機能でURLを打ち込んでもダウンロードできず、下記のエラーが永遠と続きます。
クロームもたちあがりません。どうすればつかえますか??

hitomiの漫画単体urlを入力してエンターキーを押してください
ttps://hitomi.la/galleries/1289290.html
=== エラー内容 ===
type:<class 'selenium.common.exceptions.WebDriverException'>
error:Message: unknown error: Chrome failed to start: crashed
(unknown error: DevToolsActivePort file doesn't exist)
(The process started from chrome location C:UsersUserAppDataLocalGoogleChromeApplicationchrome.exe is no longer running, so ChromeDriver is assuming that Chrome has crashed.)
(Driver info: chromedriver=2.41.578737 (49da6702b16031c40d63e5618de03a32ff6c197e),platform=Windows NT 10.0.18362 x86_64)

エラー行番号338
=== エラー内容 ===
type:<class 'AttributeError'>
error:'NoneType' object has no attribute 'find_elements_by_tag_name'
エラー行番号379
=== エラー内容 ===
type:<class 'AttributeError'>
error:'NoneType' object has no attribute 'find_elements_by_tag_name'
エラー行番号404
=== エラー内容 ===
type:<class 'AttributeError'>
error:'NoneType' object has no attribute 'current_url'
エラー行番号461
=== エラー内容 ===
type:<class 'AttributeError'>
error:'NoneType' object has no attribute 'find_element_by_xpath'
エラー行番号467
=== エラー内容 ===
type:<class 'AttributeError'>
error:'NoneType' object has no attribute 'current_url'
エラー行番号478
=== エラー内容 ===
type:<class 'AttributeError'>
error:'NoneType' object has no attribute 'find_elements_by_tag_name'
エラー行番号379
=== エラー内容 ===
type:<class 'AttributeError'>
error:'NoneType' object has no attribute 'find_elements_by_tag_name'


227.名前:名無し 2021年02月14日 11:36:03ID:dc8eb9

名前どうにかならんかな
タイトル(日本語取得不可)_>>_サイト名
物によっては120文字超える


228.名前:名無し 2021年02月20日 03:25:03ID:34bf89

nhentaiのお気に入り作品を一括ダウンロードする方法を教えてください。

229.名前:名無し 2021年03月10日 04:12:03ID:91d807

nhentaiでダウンロードした際に、URLを打ち込んでダウンロードしようとすると

DevTools listening on ws://127.0.0.1:61905/devtools/browser/c30079e0-664e-4c24-8d24-57c599f3980f
ttps://nhentai.to/g/326972/を取得します。
[7692:11960:0310/160220.176:ERROR:device_event_log_impl.cc(211)] [16:02:20.177] USB: usb_device_handle_win.cc:1049 Failed to read descriptor from node connection: システムに接続されたデバイスが機能していません。 (0x1F)
[7692:11960:0310/160220.178:ERROR:device_event_log_impl.cc(211)] [16:02:20.178] USB: usb_device_handle_win.cc:1049 Failed to read descriptor from node connection: システムに接続されたデバイスが機能していません。 (0x1F)
ttps://nhentai.to/g/326972/1/を取得します。
=== エラー内容 ===
type:<class 'OSError'>
error:[Errno 22] Invalid argument: './img/[○○]○○[DL版]/0.gif?4392184'
エラー行番号253
ttps://nhentai.to/g/318869/2/を取得します。
=== エラー内容 ===
type:<class 'OSError'>
error:[Errno 22] Invalid argument: './img/[○○]○○[DL版]/0.gif?4392184'
エラー行番号253
ttps://nhentai.to/g/318869/3/を取得します。
=== エラー内容 ===
type:<class 'OSError'>
error:[Errno 22] Invalid argument: './img/[○○]○○[DL版]/0.gif?4392184'
エラー行番号253

と延々と続いてダウンロードできません。
Chromeは開くのですが…


230.名前:名無し 2021年03月10日 04:14:03ID:91d807

○○ の部分はタイトルや作品名です。

231.名前:名無し 2021年03月11日 02:03:03ID:e6081f

pyt版のほうが正常に稼働しない
ウィンドウは出るんですが真っ黒のまま
3.7.4をインストール(下のAdにはチェック入れた)して説明書にある2つのpipは通し済み

ほかに何が足らないですか?


232.名前:名無し 2021年03月15日 05:44:03ID:30f1f4

画像をダウンロードしたらavif?となって、画像が見れないのですが、何故でしょう?

233.名前:名無し 2021年03月22日 02:26:03ID:de57ad

>>214.
タイトルバーで右クリック→編集→貼り付け
で大丈夫。


234.名前:名無し 2021年03月31日 12:24:03ID:de57ad

>>229
Windows Vista ではまだ正常に動いて
Windows 10 でエラーが起きているから、
Windows10固有の問題かもしれない。



235.名前:名無し 2021年06月01日 12:26:03ID:c5c3b9

『Hitomi ダウンローダ』でググると一番上にはここが出てきますが、
ここの管理人さんに義理立てする理由でもない限りはこっちの方が動作安定してて複数ダウンロードもOK、gif大量のファイルも安定してダウンロード出来ておすすめですね。
ht☆tps://git☆hub.com/KurtBestor/Hitomi-Downloader

しかし最近のHitomiの仕様は目に余りますね。ページを開いてる最中は新規広告タブが開きまくり。ワンクリックで広告タブが2枚開くのが当たり前。Adblockでも防げません。ほんとたちが悪い。


236.名前:名無し 2021年07月20日 07:19:03ID:23aea7

>>235
え、マジじゃん
おしえてくれてありがとう


237.名前:名無し 2021年07月31日 09:20:03ID:5a4c5a

期待してダウンロードしたら結局ゴミだった。
役に立たないものばかり作ってるとそのうちあきられてダウンロードする連中が減るからそのところ理解しろやゴミが


最後 1 2 3 4 5 6 7 8

名前   
本文


削除キー
戻る