<body> <script type="text/javascript" src="https://ad.netowl.jp/js/webcrow-php.js"></script>
私立メロン高校パソコン部
9078773

sankakucomplexダウンローダPython


2016年02月22日 06:45:39

海外画像アップローダサイトの「chan.sankakucomplex」の画像を一括で保存するソフトです。
idol.sankakucomplexとwww.sankakucomplexの方にも対応してます。

1.chan.sankakucomplex、idol.sankakucomplex、www.sankakucomplexの
画像を一括で落とします。
1.特定タグの画像を一括で落とせます。
2.全ての画像を一括で落とせます。
3.人気キャラランキング、人気作品ランキング、人気絵師ランキング、
人気アイドルランキングの画像を一括で落とせます。
4.タグ名でフォルダが作成できます。
ファイル名はデフォルトのファイル名かID名で落とせる。
5.poolやノートの画像を一括で落とせます。
6.ログインして落とせるのでログインが必要なページ数も落とせる。
7.ソートの設定が可能。新着順、人気順、評価順、お気に入り数順、
ファイルサイズが大きい順、画素数が大きい順、
横幅が大きい順、縦幅が大きい順。
8. ファイルサイズ、横幅、縦幅、画素数でフィルタリングが可能。
9. Ratingの設定でエロ画像、一般画像のみを落とすこともできる。

pythonなのでマルチプラットフォームソフトです。
MacOSX、Windows、Linuxで動きます。

2019 1/29
ダウンロード
ver1.4.4

https://mega.nz/#!63ZSWQZb!9wGB4X-MSjr6-ygWwcJWgn4bqs2oltSXEbeGyakKQjQ

posted by 管理人
カテゴリー 画像ダウンローダ
view(39849)
コメント(150)


121.名前:管理人 2018年12月28日 03:44:39ID:

>>120

setting.iniはありますか?


122.名前:名無し 2018年12月30日 10:40:39ID:2b8a36

>>121

私も同症状です。
setting.iniはsankaku.pycと同一フォルダにあります。
setting.iniを同梱の物に置き換えても同症状が出ます。

120と同じくreadme記載の通り、python・mechanizeのインストールは実施済み


123.名前:管理人 2018年12月30日 11:37:39ID:

>>120
>>122

ver1.3.7を落としてください。


124.名前:122 2018年12月30日 03:12:39ID:2b8a36

対応していただきありがとうございます。

ver1.3.7を落としましたが違うエラーが出て起動できません

Traceback (most recent call last):
File "sankaku.py", line 16, in <module>
ImportError: No module named selenium.webdriver.chrome.options



125.名前:管理人 2018年12月30日 03:47:39ID:

>>124

ver1.3.8を落としてください。


126.名前:124 2018年12月30日 04:13:39ID:2b8a36

対応していただきありがとうございます。

ver1.3.8を落としましたがver1.3.6と同系のエラーが出て起動できません

・Traceback (most recent call last):
File "sankaku.py", line 981, in <module>
IOError: [Errno 2] No such file or directory
続行するには何かキーを押してください . . .


127.名前:管理人 2018年12月30日 04:44:39ID:

>>126

ver1.3.9を落としてください。


128.名前:126 2018年12月30日 06:02:39ID:2b8a36

対応していただきありがとうございます。

ver1.3.9を落としましたが同系のエラーが出て起動できません

・Traceback (most recent call last):
File "sankaku.py", line 985, in <module>
IOError: [Errno 2] No such file or directory
続行するには何かキーを押してください . . .


130.名前:128 2018年12月30日 07:35:39ID:2b8a36

何度も対応していただきありがとうございます。

同様です。エラーが出て起動できません

・Traceback (most recent call last):
File "sankaku.py", line 985, in <module>
IOError: [Errno 2] No such file or directory
続行するには何かキーを押してください . . .

バッチファイル内での追加された1行のみをコマンドラインで実行した場合は
指定されたパスが見つかりません。
と表示されます。


132.名前:名無し 2018年12月31日 01:39:39ID:cb1c38

自分も>>130と同じエラーで起動できません
他のバージョンも同じエラーで起動できません
おそらく>>120と同様
Windows 10 October 2018 Updateにアップデートしたのが原因ではないかと
アップデートする前は問題無く使えてましたから


133.名前:名無し 2018年12月31日 02:07:39ID:5e8b9a

V1.3.9で2番のchan.sankakuからタグで落とす際に
取得記事数が100以上あるものでも22や24と異様に少なくなります
ログインは成功しているのですが、原因お分かりになりますでしょうか?


0.名前:管理人@大吉 2019年01月02日 03:59:39ID:

>>132
>>130

ver1.4.0を落としてください。


0.名前:130@大吉 2019年01月02日 06:29:39ID:2b8a36

対応していただきありがとうございます。

エラーが出ながらですが起動しました。
しかしながら使いたい機能の番号を入力してエンターキーを押すと終了してしまいます。
setting.iniに設定しているログインidは現在も有効であることを確認済みです。

=== エラー内容 ===
type:<class 'ConfigParser.NoOptionError'>
message:No option 'next_url' in section: 'config'
error:No option 'next_url' in section: 'config'
947:<class 'ConfigParser.NoOptionError'>
chan.sankakucomplexダウンローダpython ver1.4.0です。
使いたい機能の番号を入力してください。

1.chan.sankakucomplexの新着画像(全ての画像)
=中略=
21.idol.sankakucomplexの複数タグのバッチ処理
1
chan.sankakucomplexにログインします。
・Traceback (most recent call last):
File "sankaku.py", line 1017, in <module>
File "sankaku.py", line 87, in sankaku_login
IOError: [Errno 0] Error
続行するには何かキーを押してください . . .

-------------------------------

=同上のため省略=
21.idol.sankakucomplexの複数タグのバッチ処理
20
chan.sankakucomplexにログインします。
・Traceback (most recent call last):
File "sankaku.py", line 1148, in <module>
File "sankaku.py", line 87, in sankaku_login
IOError: [Errno 0] Error
続行するには何かキーを押してください . . .


0.名前:名無し@吉 2019年01月04日 05:59:39ID:7f9e3f

130と似たようなエラーが出ます。
chan のIDとPWを入れると130と似たエラーが出ます
IDとPWを入れない場合で1,2を実行すると、1ページ分の20の画像がエラーは出ながらですがダウンロードできました。

=== エラー内容 ===
type:<class 'mechanize._mechanize.BrowserStateError'>
message:not viewing any document
error:not viewing any document
457:<class 'mechanize._mechanize.BrowserStateError'>
wait開始します。
・=== エラー内容 ===
type:<type 'exceptions.IOError'>
message:
error:[Errno 0] Error
514:<type 'exceptions.IOError'>


134.名前:管理人@吉 2019年01月04日 06:14:39ID:

ver1.4.1を落としてください。

135.名前:130@大凶 2019年01月05日 02:12:39ID:2b8a36

対応していただきありがとうございます。

番号1、番号20共に動作するようになりました。
Windows10 1809へのアップデート後から不自由だったので大変助かります。

気になる点がありましたので追記させていただきます。
・tag.txtはShift_JIS保存で動作するようになりました。(どの段階かは不明ですが私がsetting.iniと同じくUTF-8で保存してました。)
・同梱のreadme.txtにver1.4.1の記載がありません。

以上ご確認ください。


136.名前:名無し 2019年01月11日 03:42:39ID:4ba788

ver1.4.1を使用しています。
「2.chan.sankakucomplexの特定タグの画像」の機能を使ったのですが


取得記記事:20
現在の記事数:19
(画像ページURL)を取得します。
=== エラー内容 ===
type:<class 'mechanize._response.httperror_seek_wrapper'>
message:
error:HTTP Error 429: Too many requests - please slow down...
113:<class 'mechanize._response.httperror_seek_wrapper'>
./img/amputee/重複をスルーします。
=== エラー内容 ===
type:<type 'exceptions.ValueError'>
message:unknown url type:
error:unknown url type:
188:<type 'exceptions.ValueError'>
取得記記事:20
現在の記事数:20
(画像ページURL)を取得します。
=== エラー内容 ===
type:<class 'mechanize._response.httperror_seek_wrapper'>
message:
error:HTTP Error 429: Too many requests - please slow down...
113:<class 'mechanize._response.httperror_seek_wrapper'>
./img/amputee/重複をスルーします。
=== エラー内容 ===
type:<class 'mechanize._response.httperror_seek_wrapper'>
message:
error:HTTP Error 429: Too many requests - please slow down...
186:<class 'mechanize._response.httperror_seek_wrapper'>
12ページ目です。
(一覧ページURL)を取得します
=== エラー内容 ===
type:<class 'mechanize._response.httperror_seek_wrapper'>
message:
error:HTTP Error 429: Too many requests - please slow down...
463:<class 'mechanize._response.httperror_seek_wrapper'>
邨ゆコ・@縺セ縺励◆縲
chan.sankakucomplexダウンローダpython ver1.4.1です。
使いたい機能の番号を入力してください。


となって途中で終了してしまいます。


137.名前:管理人 2019年01月11日 03:54:39ID:

>>139

waitを増やしてください。


138.名前:名無し 2019年01月12日 08:03:39ID:837401

Idol Complexの画像を機能21のバッチ処理で落とそうとすると複数あるタグの中の一番下の行しか落とせません。

例をあげると

striped_thighhighs
bouncing_breasts
breast_drop

のなかでbreast_dropしかダウンロードできないということです。
上2つはフォルダ自体作られません。


139.名前:管理人 2019年01月13日 02:32:39ID:

>>138

ver1.4.2を落としてください。


140.名前:名無し 2019年01月13日 08:38:39ID:161c35

アイテムが存在しない可能性があります。または、使用できなくなっています。
アイテムが削除された、期限切れになっている、または表示するアクセス許可がない可能性があります。詳細については、このアイテムの所有者に問い合わせてください。

と出てます


141.名前:名無し 2019年01月14日 09:59:39ID:bd5a19

51ページ以降から開始する機能を使ってもすぐに終了してしまいます。
英語名のタグで無ければ終了するという書き込みがあったので書き換えてみても上手くいきません。複数のタグを組み合わせているのでそれが良くないのでしょうか?

具体的にはsetting.iniに以下のように記述しています。

start_page=162
#next=IDの引数が必要なら51ページ以降のページから
#途中で開始するかどうか。
#chan.sankakucomplex.comとidol.sankakucomplex.comのみ。
#0で無効。1で有効
next_url_enable=1
#next=IDの引数が必要なら51ページ以降のページから
#途中で開始する場合のurl
#chan.sankakucomplex.comとidol.sankakucomplex.comのみ。
next_url=ttps://chan.sankakucomplex.com/?next=7157233&tags=video%203d&page=162


142.名前:管理人 2019年01月15日 06:18:39ID:

>>141

落とせるようにしたのでver1.4.3を落としてください。
setting.iniに%があるとエラーが起こるみたいなので、
tags=video%203d&page=162は
tags=video 3d&page=162にしてください。
タグをurlエンコードしないでキーワードをそのまま入れれば良いです。
空白があっても問題無いです。


143.名前:名無し 2019年01月19日 08:28:39ID:31649a

すみません タグ検索で何度も同じエラーが発生します
error:HTTP Error 429: Too many requests - please slow down...
113:<class 'mechanize._response.httperror_seek_wrapper'>
./img/デッドオアアライブ/重複をスルーします。
=== エラー内容 ===
type:<class 'mechanize._response.httperror_seek_wrapper'>
message:
error:HTTP Error 429: Too many requests - please slow down...
186:<class 'mechanize._response.httperror_seek_wrapper'>
11ページ目です。
※指定タグのURL

=== エラー内容 ===
type:<class 'mechanize._response.httperror_seek_wrapper'>
message:
error:HTTP Error 429: Too many requests - please slow down...
463:<class 'mechanize._response.httperror_seek_wrapper'>
邨ゆコ・@縺セ縺励◆縲
chan.sankakucomplexダウンローダpython ver1.4.3です。


144.名前:管理人 2019年01月19日 10:45:39ID:

>>143

waitを増やしてください。


145.名前:名無し 2019年01月27日 11:03:39ID:8f152f

御世話なります。

何時も便利に使わせて貰っています。

ver1.3.6からver1.4.3に変えたのですが、重複ファイルの扱いが変わっていませんか。
1.4.3にしたところ「重複をスルーします」と表示されても実際には上書き保存されます。
1.3.6に戻すと従来通りスルーされます。


146.名前:管理人 2019年01月29日 02:40:39ID:

>>145

ver1.4.4を落としてください。


147.名前:名無し 2019年02月02日 03:01:39ID:8f152f

>146

御世話になります。

ダウンロードしました。

が、1.4.3のようです?



148.名前:管理人 2019年02月02日 03:57:39ID:

>>147

UPし直しました。


149.名前:名無し 2019年02月03日 02:25:39ID:8f152f

>148

御世話になります。

重複ファイルがスルーされるを確認しました。

対応有難う御座いました。



最後 1 2 3 4 5

名前   
本文


削除キー
戻る